Issues filed for BVLC/caffe

View Full Project
Do you use caffe? Leave a review!

Rate of open issues in the last 60 days

caffe open issues (View Closed Issues)
  • over 1 year I set the channel in deploy.txt =1 because my images are grayscal images. I need to add is_color=false in data_image_param. First of all in the Alexnet train_val.prototxt there is data_param and not data_image_param!!!! and when I add is_color in data_param I get this error "caffe.DataParameter" has no field named "is_color". Can you please help me?
  • over 1 year I have two identical GPUs in my machine but when fine tune it seems only one of them is used #3
  • over 1 year make grayscale lmdb problem
  • over 1 year CUDNN doesn't support the dilated convolution at Lyaer ***
  • over 1 year matcaffe compilation error- No such "header" file or directory
  • over 1 year make: *** [.build_release/cuda/src/caffe/layers/detection_output_layer.o] Error 1
  • over 1 year Ubuntu 16.04 “/usr/bin/ld: cannot find -llmdb” error in Caffe compilation
  • over 1 year libstdc++.so.6: version `GLIBCXX_3.4.21' not found
  • over 1 year Zero accuracy, loss not decreasing and layers have the same value for different inputs
  • over 1 year Issues with compiling caffe with python, undefined reference to `std::__cxx11::…'
  • over 1 year error while loading shared libraries: libcaffe.so.1.0.0-rc3
  • over 1 year bug report: floating point exception when stepsize 0
  • over 1 year CUDA error after input layer reshape
  • over 1 year Training weight dump out
  • over 1 year problem.. /usr/bin/ld: cannot find -lopencv_imgcodecs
  • over 1 year Caffe Regression: net prediction is much larger than label but the training loss is very small
  • over 1 year Installing Caffe Windows
  • over 1 year I couldn't import _caffe, while I could import caffe. With the help of cmake, I couldn't found _caffe.py.
  • over 1 year .so of caffe which wrapper by myself run very slowly in cgo of golang and thrift(muiti threads)?
  • over 1 year Caffe-opencl for Windows
  • over 1 year Fine-Tuning 2 Fully Connected Layers (Classification and Regression)
  • over 1 year Mac 10.12.1 Sierra Xcode 8.1 cmake 1.vecLib 2.numpy 3.anaconda opencv
  • over 1 year How to modify the model to fit in your demand?
  • over 1 year I'm new here, thanks for your help!
  • over 1 year I met a trouble while trying to "import caffe"
  • over 1 year Caffe Build Error
  • over 1 year dlopen _caffe.so Symbol not found
  • over 1 year test_gradient_based_solver.testbin gives memory corruption
  • over 1 year Memory leaking ?
  • over 1 year Loss Layer Should Die Loudly for Unsupported Arguments
  • over 1 year compared with caffe engine, can cudnn save gpu memory?
  • over 1 year Exception: “dot” not found in path in python on mac
  • over 1 year Memory leak when using reshape
  • over 1 year unresolved void __cdecl caffe::caffe_gpu_dot on windows7 64bit
  • over 1 year [libprotobuf ERROR google/protobuf/descriptor_database.cc.57] , if when I import caffe with openCV
  • over 1 year 'module' object has no attribute 'io', while importing caffe in Ubuntu 16.04
  • over 1 year Caffe stuck waiting on multiple boost::condition_variable in all threads in caffe::BlockingQueue
  • over 1 year How to make with cuDNN?
  • over 1 year Something wrong with `make runtest`
  • over 1 year Multi-GPU caffe trainning is slow with CuDNN
  • over 1 year Caffe installation error on Mac
  • over 1 year AttributeError: 'module' object has no attribute 'io'; a = caffe.io.caffe_pb2.BlobProto.FromString(proto_data)
  • over 1 year CUDA invalid device ordinal
  • over 1 year make pycaffe error1
  • over 1 year How to perform finetuning on a network which has batch normalization layer?
  • over 1 year Why different versions of caffe output very different results?
  • over 1 year Add MATLAB support with the CMake build on windows
  • over 1 year Please move calls to ShareData() to Reshape() function
  • over 1 year Achieve more pooling type
  • over 1 year Modifying padded values for convolution layer
  • over 1 year caffe installation error with protobuf
  • over 1 year Convolution padding check
  • over 1 year Is it symbolic link about libcudart.so.5.5 or then cuda version problem?
  • over 1 year Python function problem: no error information provides when prototxt parses error.
  • over 1 year To save GPU memory by re-using.
  • over 1 year How to check the layer type in Caffe source code
  • over 1 year How to resize mean_file instead of resizing my lmdb?
  • over 1 year Fast R-CNN for caffe-opencl
  • over 1 year Mac OS Sierra Version 10.12 throws error while building latest commit of caffe
  • over 1 year DeepFool implementation on Caffe
  • over 1 year No support for unicode literals on caffe.Net
  • over 1 year Computational error with K40
  • over 1 year Mac import caffe error
  • over 1 year Segmentation fault while running under .py file.
  • over 1 year make runtest errro:
  • over 1 year NVIDIA Jetson TX1 memory problem
  • over 1 year AttributeError: 'module' object has no attribute 'io'
  • over 1 year compile error in CPU only mode
  • over 1 year How to feed the weights of the neurons in C++ to blobs in caffe?
  • over 1 year can pycaffe pass gradient test?
  • over 1 year protoc compiler not found
  • over 1 year "dyld: lazy symbol binding failed" when i ran make runtest on Mac OS 10.9.3
  • over 1 year Network with 2 images input.
  • over 1 year Is there a relation between the number of iterations needed and the amount of training data provide ?
  • over 1 year How to online fine-tune a model?
  • over 1 year Solve the problem: "cannot find -lboost_python3" when using Python3 Ubuntu16.04
  • over 1 year make matcaffe places library outside of build dir
  • over 1 year To Brodyh
  • over 1 year Undefined variable or function 'caffe'
  • over 1 year runtest accuracy/roundoff failures in 26 CPUDevice tests when using MKL (all GPUDevice tests ok)
  • over 1 year Should there be a Reshape function for contrastive_loss_layer
  • over 1 year Running Caffe on Titan x Pascal - Windows
  • over 1 year Question about learn rate in lenet net.
  • over 1 year gpu docker buildfile tell download mismatch when RUN step3 sometimes
  • over 1 year I can't find caffe.proto file in …\src\caffe\proto
  • over 1 year how to regression in caffe
  • over 1 year TimerTest Fails for GPUDevice on Windows
  • over 1 year multi_label_image_data_layer
  • over 1 year Installing caffe on ubuntu 16.04 with 2 versions of Cuda installed (7.5 and 8)
  • over 1 year C++ Classifier on FromProto function
  • over 1 year Compile with Matlab interface error
  • over 1 year Inconsistent loss in shallow networks with MemoryData as input layer
  • over 1 year Compile Termination Issue
  • over 1 year convert imageset doesn't work for validation data of imagenet
  • over 1 year Problem with the CPU_ONLY in the source code of caffe.cpp
  • over 1 year Does anyone compile on ubuntu and have to change the #include location of hdf5.h?
  • over 1 year infogain_loss_layer for 2D output
  • over 1 year Docker error:Error: image library/caffe:cpu not found.
  • over 1 year Cmake and make libgflags error
  • over 1 year Caffe installation with Anaconda Python: libglogs libgflags error

caffe closed issues

  • over 1 year Segmentation fault (core dumped) after add a new python layer
  • over 1 year Errors when run the example of "Fine-tuning CaffeNet"
  • over 1 year matcaffe compilation error- unrecognized command line option "-std=c++11"
  • over 1 year Understanding the deconvolution in FCN-32.
  • over 1 year make test fails in opencl branch: Error when compiling test_libdnn_pool.cpp
  • over 1 year libcudart.so.8.0: cannot open shared object file: No such file or directory
  • over 1 year File for {} is missing. Should be at: {}".format(key, val))
  • over 1 year Cmake can't find boost
  • over 1 year error when installing caffe
  • over 1 year Typo in include/caffe/layers/accuracy_layer.hpp
  • over 1 year Caffe installation issue with 'libculibos'.
  • over 1 year Unknown CMake command "caffe_protobuf_generate_cpp_py"
  • over 1 year Something wrong with GPU TITAN X (Pascal) ?
  • over 1 year Using Matcaffe, Solver scaffolding done then matlab crashed.
  • over 1 year blobs_lr vs lr_mult in caffe?
  • over 1 year Check failed: data_
  • over 1 year Request implement the Lp-pooling and Mixed pooling
  • over 1 year How to performing Finetune on a network which has batch normalization layer?
  • over 1 year During test phase, the output of Batch Normalization layer is not equal to (input-mean)/sqrt(var + eps)?
  • over 1 year How to modify a prototxt programmatically?
  • over 1 year ImportError when implementing Python Layer in Caffe
  • over 1 year Where is Model ZOO wiki page?
  • over 1 year Error with OpenCV imgcodecs while running make all
  • over 1 year model zoo gone?
  • over 1 year multi gpu support for lstm layer
  • over 1 year Is there layers for feature(vector) indexing in caffe?
  • over 1 year Purpose of set -e and $@ in train_quick.sh in cifar10 example
  • over 1 year fatal error: hdf5.h: No such file or directory
  • over 1 year Error when using “fcn.berkeleyvision.org”
  • over 1 year The speed of detection slows down when the batch size is increased. Is it normal?
  • over 1 year Check failed too many resources requested for launch for pooling_layer.cu
  • over 1 year 123
  • over 1 year Python kernel is dead when I switch to GPU mode and run net.forward()
  • over 1 year question about deploy.prototxt
  • over 1 year Caffe on Windows maintained?
  • over 1 year Not able to download pretrianed caffe model files - Error: No route to host
  • over 1 year Not able to download pretrianed caffe model files (.caffemodelfailed) - Error: No route to host
  • over 1 year Feature extracted with caffe and caffe_windows seems different
  • over 1 year Question about the binary protocal buffer
  • over 1 year problem to compile caffe with cmake
  • over 1 year caffe cuda 8.0 fmake runtest failing
  • over 1 year Getting an error while using convert_imageset
  • over 1 year SoftmaxWithLoss layer for image segmentation
  • over 1 year set different learning rate for different loss task
  • over 1 year Web Demo Installation link broken
  • over 1 year Error in LeNet on MNIST example
  • over 1 year [doc] problematic markdown rendering at http://caffe.berkeleyvision.org/install_apt_debian.html
  • over 1 year status ==CURAND_STATUS_SUCCESS (201 vs. 0) CURAND_STATUS_LAUNCH_FAILURE
  • over 1 year Why there is no libcaffe.lib in windows branch installation.
  • over 1 year How to set "WITH_PYTHON_LAYER := 1"?
  • over 1 year comment